�S���n�������c�̃R�[�h,ID,����,����_�J�i,����_�p��,���ݒn_�S���n�������c�̃R�[�h,���ݒn_�A���W�L,���ݒn_�s���{��,���ݒn_�s�撬��,���ݒn_����,���ݒn_�Ԓn�ȉ�,���������i�����j,�ܓx,�o�x,�W��,�d�b�ԍ�,�S���n�������c�̃R�[�h,�s���{����,�s�撬����,�ЊQ���_�^��,�ЊQ���_�R����A�y�Η��y�ђn����,�ЊQ���_����,�ЊQ���_�n�k,�ЊQ���_�Ôg,�ЊQ���_��K�͂ȉΎ�,�ЊQ���_�����×�,�ЊQ���_�ΎR����,�w����Ƃ̏d��,�z����e�l��,�ΏۂƂȂ钬��E������,URL,�摜,�摜_���C�Z���X,���l
172090,,���ق��s����C���w�Z,�J�z�N�V���c�I�I�~�V���E�K�b�R�E,,,�ΐ쌧���ق��s�ČI��10,�ΐ쌧,���ق��s,�ČI,��10,,36.77861,136.747784,16.3,076-281-0270,172090,�ΐ쌧,���ق��s,1,1,1,1,1,,,,1,,�������A��΁A���ŁA�����A����A�쎛�A����A���˒��A�ČI�A�����A��c��,,,,
172090,,���ق��s���������w�Z,�J�z�N�V���c�^�J�}�c�V���E�K�b�R�E,,,�ΐ쌧���ق��s������10,�ΐ쌧,���ق��s,����,��10,,36.769018,136.719443,18.5,076-281-0068,172090,�ΐ쌧,���ق��s,1,1,1,1,1,,,,1,,�����A���쒬�A�Z�����A�����A��k���A�k�����A�k�V���A�ݐ쒬�A���䒬�A���ɒO���A��ɒO���A�����A�w����,,,,
172090,,���ق��s���������w�Z,�J�z�N�V���c�^�J�}�c�`���E�K�b�R�E,,,�ΐ쌧���ق��s������42,�ΐ쌧,���ق��s,����,��42,,36.767625,136.721076,27,076-281-0221,172090,�ΐ쌧,���ق��s,1,1,1,1,1,,,,1,,�쒬�A�Ë{���A��V���A�����A������,,,,
172090,,���ق��s�����ˏ��w�Z,�J�z�N�V���c�i�i�c�J�V���E�K�b�R�E,,,�ΐ쌧���ق��s�ؒÃz61-1,�ΐ쌧,���ق��s,�ؒ�,�z61-1,,36.748098,136.701713,14.8,076-285-0022,172090,�ΐ쌧,���ق��s,1,1,1,1,1,,,,1,,�ؒÁA���l,,,,
172090,,���ق��s���͖k�䒆�w�Z,�J�z�N�V���c�J�z�N�_�C�`���E�K�b�R�E,,,�ΐ쌧���ق��s���˃�47-1,�ΐ쌧,���ق��s,����,��47-1,,36.734679,136.703358,38.5,076-285-0262,172090,�ΐ쌧,���ق��s,1,1,1,1,1,,,,1,,���ˁA�l�k�A�H�l,,,,
172090,,���ق��s���O���p���w�Z,�J�z�N�V���c�\�g�q�X�~�V���E�K�b�R�E,,,�ΐ쌧���ق��s�O���p�j52,�ΐ쌧,���ق��s,�O���p,�j52,,36.723714,136.691802,35.7,076-283-0040,172090,�ΐ쌧,���ق��s,1,1,1,1,1,,,,1,,�O���p�A����,,,,
172090,,���ق��s�����Ï��w�Z,�J�z�N�V���c�J�i�d�V���E�K�b�R�E,,,�ΐ쌧���ق��s�J�J30,�ΐ쌧,���ق��s,�J,�J30,,36.741695,136.725461,26,076-285-0216,172090,�ΐ쌧,���ق��s,1,1,1,1,1,,,,1,,���R�A�J�A�}���A��c���A�]�n,,,,
172090,,���ق��s���F�m�C���w�Z,�J�z�N�V���c�E�m�P�c�`���E�K�b�R�E,,,�ΐ쌧���ق��s�X��1,�ΐ쌧,���ق��s,�X,��1,,36.723293,136.706929,5.5,076-283-0065,172090,�ΐ쌧,���ق��s,1,1,1,1,1,,,,1,,�X�A����A�C���A��R�c�A���R�c�A�����A�F�C�A���E,,,,
172090,,���ق��s���F�m�C���w�Z,�J�z�N�V���c�E�m�P�V���E�K�b�R�E,,,�ΐ쌧���ق��s�F��C��147,�ΐ쌧,���ق��s,�F��C,��147,,36.719962,136.704305,4.3,076-283-0014,172090,�ΐ쌧,���ق��s,1,1,1,1,1,,,,1,,�뎭��A�w�]�A���c�A�F��C�A�����p�A���,,,,
172090,,��C�𗬃Z���^�[,�I�I�~�R�E�����E�Z���^�[,,,�ΐ쌧���ق��s�ČI��34,�ΐ쌧,���ق��s,�ČI,��34,,36.778534,136.749334,16.9,076-281-2123,172090,�ΐ쌧,���ق��s,,1,1,1,1,,,,,,,,,,
172090,,�����O���E���h�E�S���t��,�^�J�}�c�O���E���h�S���t�W���E,,,�ΐ쌧���ق��s�j�c���}�P,�ΐ쌧,���ق��s,�j�c��,�}�P,,36.786748,136.730961,27.7,076-281-3751,172090,�ΐ쌧,���ق��s,,,1,1,1,,,,,,,,,,
172090,,�����Y�ƕ����Z���^�[,�^�J�}�c�T���M���E�u���J�Z���^�[,,,�ΐ쌧���ق��s�����N42-1,�ΐ쌧,���ق��s,����,�N42-1,,36.769359,136.721265,26.1,076-281-3176,172090,�ΐ쌧,���ق��s,1,1,1,1,1,,,,,,,,,,
172090,,�����܂܂����ǌ𗬊�,�^�J�}�c�}�`�J�h�R�E�����E�J��,,,�ΐ쌧���ق��s�����c56-1,�ΐ쌧,���ق��s,����,�c56-1,,36.77148,136.717075,7,076-282-5760,172090,�ΐ쌧,���ق��s,1,1,1,1,1,,,,,,,,,,
172090,,�����V�l�����Z���^�[,�^�J�}�c���E�W���t�N�V�Z���^�[,,,�ΐ쌧���ق��s�����k100,�ΐ쌧,���ق��s,����,�k100,,36.771332,136.739513,37.5,076-282-5347,172090,�ΐ쌧,���ق��s,1,1,1,1,1,,,,��,,,,,,
172090,,�A�N���X����,�A�N���X�^�J�}�c,,,�ΐ쌧���ق��s�������j12,�ΐ쌧,���ق��s,������,�j12,,36.762446,136.734402,15.7,076-281-8000,172090,�ΐ쌧,���ق��s,1,,1,1,1,,,,,,,,,,
172090,,���ق��s�T�b�J�[�E���O�r�[���Z��,�J�z�N�V�T�b�J�[�E���O�r�[�W���E,,,�ΐ쌧���ق��s�������I80,�ΐ쌧,���ق��s,������,�I80,,36.765641,136.733579,27.5,-,172090,�ΐ쌧,���ق��s,,,1,1,1,,,,,,,,,,
172090,,�����싅��,�^�J�}�c���L���E�W���E,,,�ΐ쌧���ق��s�������I�P,�ΐ쌧,���ق��s,������,�I�P,,36.763733,136.735715,40.2,-,172090,�ΐ쌧,���ق��s,,,1,1,1,,,,,,,,,,
172090,,�ؒÌ���,�L�d�R�E�G��,,,�ΐ쌧���ق��s�ؒÃw30-�P��,�ΐ쌧,���ق��s,�ؒ�,�w30-�P��,,36.74717,136.703299,21.9,-,172090,�ΐ쌧,���ق��s,,,1,1,1,,,,,,,,,,
172090,,���ː��U�w�K�Z���^�[,�i�i�c�J�V���E�K�C�K�N�V���E�Z���^�[,,,�ΐ쌧���ق��s���˃�57-6,�ΐ쌧,���ق��s,����,��57-6,,36.735523,136.699982,41.1,076-285-1100,172090,�ΐ쌧,���ق��s,1,1,1,1,1,,,,,,,,,,
172090,,�͖k�䌒���̈��,�J�z�N�_�C�P���~���^�C�C�N�J��,,,�ΐ쌧���ق��s�l�k�C25-3,�ΐ쌧,���ق��s,�l�k,�C25-3,,36.733065,136.70261,38.4,076-283-4559,172090,�ΐ쌧,���ق��s,1,1,1,1,1,,,,,,,,,,
172090,,���˕�����,�i�i�c�J�u�h�E�J��,,,�ΐ쌧���ق��s�l�k�C25-16,�ΐ쌧,���ق��s,�l�k,�C25-16,,36.733065,136.70261,36.5,076-283-4588,172090,�ΐ쌧,���ق��s,1,1,1,1,1,,,,,,,,,,
172090,,���˒�������,�i�i�c�J�`���E�I�E�R�E�G��,,,�ΐ쌧���ق��s���˃j17-�P��,�ΐ쌧,���ق��s,����,�j17-�P��,,36.736261,136.696282,28.4,076-285-2191,172090,�ΐ쌧,���ق��s,,,1,1,1,,,,,,,,,,
172090,,���ˑ̈�Z���^�[,�i�i�c�J�^�C�C�N�Z���^�[,,,�ΐ쌧���ق��s�����i97,�ΐ쌧,���ق��s,����,�i97,,36.714142,136.687982,45.2,076-283-3151,172090,�ΐ쌧,���ق��s,1,1,1,1,1,,,,,,,,,,
172090,,�������������,�V���I�V�������R�E�G��,,,�ΐ쌧���ق��s������24��,�ΐ쌧,���ق��s,����,��24��,,36.717752,136.697197,21.9,,172090,�ΐ쌧,���ق��s,,,1,1,1,,,,,,,,,,
172090,,�悱��܌��C��,���R���}�P���V���E�J��,,,�ΐ쌧���ق��s���R��2-14,�ΐ쌧,���ق��s,���R,��2-14,,36.746524,136.719077,11.4,076-285-2034,172090,�ΐ쌧,���ق��s,1,1,1,1,1,,,,,,,,,,
172090,,�����т̐X���ق�����,�J�i�d�^�C�C�N�J��,,,�ΐ쌧���ق��s�J��108,�ΐ쌧,���ق��s,�J,��108,,36.742941,136.728014,22.6,076-208-3517,172090,�ΐ쌧,���ق��s,1,1,1,1,1,,,,,,,,,,
172090,,�����u����,�t�W�K�I�J�R�E�G��,,,�ΐ쌧���ق��s��c���j24,�ΐ쌧,���ق��s,��c��,�j24,,36.743308,136.734601,22,-,172090,�ΐ쌧,���ق��s,,,1,1,1,,,,,,,,,,
172090,,�J����,�^�j�R�E�G��,,,�ΐ쌧���ق��s�J�C92��,�ΐ쌧,���ق��s,�J,�C92��,,36.74286,136.72745,21.9,-,172090,�ΐ쌧,���ق��s,,,1,1,1,,,,,,,,,,
172090,,���E�̈��,�i�i�N�{�^�C�C�N�J��,,,�ΐ쌧���ق��s���E�z41,�ΐ쌧,���ق��s,���E,�z41,,36.726553,136.710045,3.7,-,172090,�ΐ쌧,���ق��s,,,1,1,1,,,,,,,,,,
172090,,�F�m�C�V����,�E�m�P�V���J�J��,,,�ΐ쌧���ق��s�X��20,�ΐ쌧,���ق��s,�X,��20,,36.722854,136.706287,4.5,-,172090,�ΐ쌧,���ق��s,1,1,1,1,1,,,,,,,,,,
172090,,���̂������������㋣�Z��,�E�m�P�\�E�S�E�R�E�G��,,,�ΐ쌧���ق��s���R�c��85,�ΐ쌧,���ق��s,���R�c,��85,,36.72089,136.727847,15.7,076-283-2835,172090,�ΐ쌧,���ق��s,,,1,1,1,,,,,,,,,,
172090,,���ق��s���N�싅��,�E�m�P���L���E�W���E,,,�ΐ쌧���ق��s���R�c��7,�ΐ쌧,���ق��s,���R�c,��7,,36.718397,136.723921,10.4,-,172090,�ΐ쌧,���ق��s,,,1,1,1,,,,,,,,,,
172090,,�F�m�C�̈�Z���^�[,�E�m�P�^�C�C�N�Z���^�[,,,�ΐ쌧���ق��s���R�c�N39-1,�ΐ쌧,���ق��s,���R�c,�N39-1,,36.718397,136.723921,11.8,076-283-4505,172090,�ΐ쌧,���ق��s,1,1,1,1,1,,,,,,,,,,
172090,,�F�m�C���U�w�K�Z���^�[,�E�m�P�V���E�K�C�K�N�V���E�Z���^�[,,,�ΐ쌧���ق��s�F��C�j110-�P,�ΐ쌧,���ق��s,�F��C,�j110-�P,,36.720388,136.706621,4.6,076-283-0057,172090,�ΐ쌧,���ق��s,,1,1,1,1,,,,,,,,,,
172090,,�F��C������,�E�m�P�R�E�~���J��,,,�ΐ쌧���ق��s�F��C��196,�ΐ쌧,���ق��s,�F��C,��196,,36.7207,136.703767,7.7,076-283-4488,172090,�ΐ쌧,���ق��s,1,1,1,1,1,,,,,,,,,,
172090,,�F�m�C�X�|�[�c�Z���^�[,�E�m�P�X�|�[�c�Z���^�[,,,�ΐ쌧���ق��s�F��C��196-�P,�ΐ쌧,���ق��s,�F��C,��196-�P,,36.720576,136.703969,7.7,-,172090,�ΐ쌧,���ق��s,1,1,1,1,1,,,,,,,,,,
172090,,�F�m�C�V�l�����Z���^�[,�E�m�P���E�W���t�N�V�Z���^�[,,,�ΐ쌧���ق��s�����p�E4-1,�ΐ쌧,���ق��s,�����p,�E4-1,,36.715157,136.694455,28.1,076-283-3775,172090,�ΐ쌧,���ق��s,1,1,1,1,1,,,,��,,,,,,
172090,,���c�����Y�L�O�N�w��,�j�V�_�L�^���E�L�l���e�c�K�N�J��,,,�ΐ쌧���ق��s�����p��P,�ΐ쌧,���ق��s,�����p,��P,,36.714254,136.693784,38.3,076-283-6600,172090,�ΐ쌧,���ق��s,1,1,1,1,1,,,,,,,,,,
172090,,���斯���,�I�I�T�L�N�~���J�C�J��,,,�ΐ쌧���ق��s���`115,�ΐ쌧,���ق��s,���,�`115,,36.705181,136.690727,2.9,076-283-0059,172090,�ΐ쌧,���ق��s,1,1,1,1,1,,,,,,,,,,
172090,,�F�m�C�암�̈��,�E�m�P�i���u�^�C�C�N�J��,,,�ΐ쌧���ق��s���`73,�ΐ쌧,���ق��s,���,�`73,,36.70495,136.690251,2.9,076-283-4690,172090,�ΐ쌧,���ق��s,1,1,1,1,1,,,,,,,,,,
172090,,�w�]�R�~���j�e�B�Z���^�[,�T�V�G�R�~���j�e�B�Z���^�[,,,�ΐ쌧���ق��s�w�]�t�P,�ΐ쌧,���ق��s,�w�],�t�P,,36.70563,136.719526,4.5,076-283-4293,172090,�ΐ쌧,���ق��s,1,1,1,1,1,,,,,,,,,,
172090,,���������,�V�I�~�_�C�R�E�G��,,,�ΐ쌧���ق��s��蒪����177,�ΐ쌧,���ق��s,��蒪����,177,,36.709834,136.683541,35,-,172090,�ΐ쌧,���ق��s,,,1,1,1,,,,,,,,,,
